Reaction Details
TargetD(3) dopamine receptor
LigandBDBM50002012
Substrate/Competitorn/a
Ki 1.7±n/a nM
CommentsPDSP_4325
Citation Burstein, ESMa, JWong, SGao, YPham, EKnapp, AENash, NROlsson, RDavis, REHacksell, UWeiner, DMBrann, MR Intrinsic efficacy of antipsychotics at human D2, D3, and D4 dopamine receptors: identification of the clozapine metabolite N-desmethylclozapine as a D2/D3 partial agonist. J Pharmacol Exp Ther315:1278-87 (2005) 
 
D(3) dopamine receptor
Name:D(3) dopamine receptor
Type:n/a
Mol. Mass.:44243.43
Organism:Homo sapiens (Human)
Description:n/a
Residue:400
BDBM50002012
NameBDBM50002012
Synonyms:(trans) 2-{4-[3-(4-Fluoro-phenyl)-6-trifluoromethyl-indan-1-yl]-piperazin-1-yl}-ethanol CHEMBL1204138 tefludazine
TypeSmall organic molecule
Emp. Form.C22H24F4N2O
Mol. Mass.408.4324
SMILESOCCN1CCN(CC1)C1CC(c2ccc(cc12)C(F)(F)F)c1ccc(F)cc1