Reaction Details
TargetD(4) dopamine receptor
LigandBDBM81493
Substrate/Competitorn/a
Ki 326±n/a nM
CommentsPDSP_2608
Citation Burstein, ESMa, JWong, SGao, YPham, EKnapp, AENash, NROlsson, RDavis, REHacksell, UWeiner, DMBrann, MR Intrinsic efficacy of antipsychotics at human D2, D3, and D4 dopamine receptors: identification of the clozapine metabolite N-desmethylclozapine as a D2/D3 partial agonist. J Pharmacol Exp Ther315:1278-87 (2005) 
 
D(4) dopamine receptor
Name:D(4) dopamine receptor
Type:Enzyme
Mol. Mass.:48373.19
Organism:Homo sapiens (Human)
Description:P21917
Residue:419
BDBM81493
NameBDBM81493
Synonyms:CAS_749-13-3 | TRIFLUORPERIDOL
TypeSmall organic molecule
Emp. Form.C22H23F4NO2
Mol. Mass.409.4171
SMILESOC1(CCN(CC1)C(F)CCC(=O)c1ccccc1)c1cccc(c1)C(F)(F)F