Reaction Details
TargetProtein kinase C alpha type
LigandBDBM86727
Substrate/Competitorn/a
Ki 6000±n/a nM
CommentsPDSP_6134
Citation Braverman, ASTibb, ASRuggieri, MR M2 and M3 muscarinic receptor activation of urinary bladder contractile signal transduction. I. Normal rat bladder. J Pharmacol Exp Ther316:869-74 (2006) 
 
Protein kinase C alpha type
Name:Protein kinase C alpha type
Type:Protein
Mol. Mass.:76797.67
Organism:Rattus norvegicus (Rat)
Description:P05696
Residue:672
BDBM86727
NameBDBM86727
Synonyms:1-(5-isoquinolinesulfonyl)-2-methylpiperazine.2HCl | CAS_140663-38-3
TypeSmall organic molecule
Emp. Form.C14H17N3O2S
Mol. Mass.291.369
SMILESCC1CN(CCN1)S(=O)(=O)c1cccc2cnccc12