Reaction Details
TargetRho-associated protein kinase 2
LigandBDBM86729
Substrate/Competitorn/a
Ki 100±n/a nM
CommentsPDSP_6132
Citation Braverman, ASTibb, ASRuggieri, MR M2 and M3 muscarinic receptor activation of urinary bladder contractile signal transduction. I. Normal rat bladder. J Pharmacol Exp Ther316:869-74 (2006) 
 
Rho-associated protein kinase 2
Name:Rho-associated protein kinase 2
Type:Protein
Mol. Mass.:160370.90
Organism:Rattus norvegicus (Rat)
Description:Q62868
Residue:1388
BDBM86729
NameBDBM86729
Synonyms:(R)-(+)-trans-4-(1-aminoethyl)-N-(4-pyridyl)cyclohexanecarboxamide dihydrochloride Y-27632
TypeSmall organic molecule
Emp. Form.C14H21N3O
Mol. Mass.247.336
SMILESC[C@@H](N)[C@H]1CC[C@@H](CC1)C(=O)Nc1ccncc1