Reaction Details
TargetSodium-dependent dopamine transporter
LigandBDBM22417
Substrate/Competitorn/a
Ki 1000±n/a nM
CommentsPDSP_1329
Citation Chalon, SHall, HSaba, WGarreau, LDollé, FHalldin, CEmond, PBottlaender, MDeloye, JBHelfenbein, JMadelmont, JCBodard, SMincheva, ZBesnard, JCGuilloteau, D Pharmacological characterization of (E)-N-(4-fluorobut-2-enyl)-2beta-carbomethoxy-3beta-(4'-tolyl)nortropane (LBT-999) as a highly promising fluorinated ligand for the dopamine transporter. J Pharmacol Exp Ther317:147-52 (2006) 
 
Sodium-dependent dopamine transporter
Name:Sodium-dependent dopamine transporter
Type:Multi-pass membrane protein
Mol. Mass.:68749.45
Organism:Rattus norvegicus (rat)
Description:P23977
Residue:619
BDBM22417
NameBDBM22417
Synonyms:3-(2-methoxyphenoxy)-N-methyl-3-phenylpropan-1-amine LY 135252 LY135252 Nisoxetine US9944618, Compound ID No. 177 [3H]Nisoxetine
Typeradiolabeled ligand
Emp. Form.C17H21NO2
Mol. Mass.271.3541
SMILESCNCCC(Oc1ccccc1OC)c1ccccc1