Reaction Details
TargetSodium-dependent dopamine transporter
LigandBDBM50296782
Substrate/Competitorn/a
Ki 18±n/a nM
CommentsPDSP_6107
Citation Chalon, SHall, HSaba, WGarreau, LDollé, FHalldin, CEmond, PBottlaender, MDeloye, JBHelfenbein, JMadelmont, JCBodard, SMincheva, ZBesnard, JCGuilloteau, D Pharmacological characterization of (E)-N-(4-fluorobut-2-enyl)-2beta-carbomethoxy-3beta-(4'-tolyl)nortropane (LBT-999) as a highly promising fluorinated ligand for the dopamine transporter. J Pharmacol Exp Ther317:147-52 (2006) 
 
Sodium-dependent dopamine transporter
Name:Sodium-dependent dopamine transporter
Type:Multi-pass membrane protein
Mol. Mass.:68749.45
Organism:Rattus norvegicus (rat)
Description:P23977
Residue:619
BDBM50296782
NameBDBM50296782
Synonyms:(1R,2S,3S,5S)-methyl 8-((E)-3-iodoallyl)-3-p-tolyl-8-azabicyclo[3.2.1]octane-2-carboxylate PE2I
TypeSmall organic molecule
Emp. Form.C19H24INO2
Mol. Mass.425.3038
SMILESCOC(=O)[C@@H]1[C@H]2CC[C@@H](C[C@@H]1c1ccc(C)cc1)N2C\C=C\I