Reaction Details
Target5-hydroxytryptamine receptor 2C
LigandBDBM26739
Substrate/Competitorn/a
Ki>10000±n/a nM
CommentsPDSP_5529
Citation Gobbi, GBambico, FRMangieri, RBortolato, MCampolongo, PSolinas, MCassano, TMorgese, MGDebonnel, GDuranti, ATontini, ATarzia, GMor, MTrezza, VGoldberg, SRCuomo, VPiomelli, D Antidepressant-like activity and modulation of brain monoaminergic transmission by blockade of anandamide hydrolysis. Proc Natl Acad Sci U S A102:18620-5 (2005) 
 
5-hydroxytryptamine receptor 2C
Name:5-hydroxytryptamine receptor 2C
Type:Enzyme
Mol. Mass.:51935.10
Organism:Rattus norvegicus (Rat)
Description:P08909
Residue:460
BDBM26739
NameBDBM26739
Synonyms:3-(3-carbamoylphenyl)phenyl N-cyclohexylcarbamate URB 597 URB597 | US9187413, 1a (URB597)
TypeSmall organic molecule
Emp. Form.C20H22N2O3
Mol. Mass.338.4003
SMILESNC(=O)c1cccc(c1)-c1cccc(OC(=O)NC2CCCCC2)c1