Reaction Details
TargetMacrophage-stimulating protein receptor
LigandBDBM50237710
Substrate/Competitorn/a
Ki 8992±n/a nM
CommentsPDSP_6404
Citation Melnick, JSJanes, JKim, SChang, JYSipes, DGGunderson, DJarnes, LMatzen, JTGarcia, MEHood, TLBeigi, RXia, GHarig, RAAsatryan, HYan, SFZhou, YGu, XJSaadat, AZhou, VKing, FJShaw, CMSu, AIDowns, RGray, NSSchultz, PGWarmuth, MCaldwell, JS An efficient rapid system for profiling the cellular activities of molecular libraries. Proc Natl Acad Sci U S A103:3153-8 (2006) 
 
Macrophage-stimulating protein receptor
Name:Macrophage-stimulating protein receptor
Type:Protein
Mol. Mass.:152270.76
Organism:Homo sapiens (Human)
Description:Q04912
Residue:1400
BDBM50237710
NameBDBM50237710
Synonyms:4-methyl-N-[3-(4-methyl-1H-imidazol-1-yl)-5-(trifluoromethyl)phenyl]-3-[(4-pyridin-3-ylpyrimidin-2-yl)amino]benzamide AMN107 NILOTINIB | US11649218, Example Nilotinib
TypeSmall organic molecule
Emp. Form.C28H22F3N7O
Mol. Mass.529.5158
SMILESCc1cn(cn1)-c1cc(NC(=O)c2ccc(C)c(Nc3nccc(n3)-c3cccnc3)c2)cc(c1)C(F)(F)F