Reaction Details
TargetHistamine H2 receptor
LigandBDBM86740
Substrate/Competitorn/a
Ki 23±n/a nM
CommentsPDSP_6456
Citation Xie, SXKraus, AGhorai, PYe, QZElz, SBuschauer, ASeifert, R N1-(3-cyclohexylbutanoyl)-N2-[3-(1H-imidazol-4-yl)propyl]guanidine (UR-AK57), a potent partial agonist for the human histamine H1- and H2-receptors. J Pharmacol Exp Ther317:1262-8 (2006) 
 
Histamine H2 receptor
Name:Histamine H2 receptor
Type:G Protein-Coupled Receptor (GPCR)
Mol. Mass.:40115.31
Organism:Homo sapiens (Human)
Description:n/a
Residue:359
BDBM86740
NameBDBM86740
Synonyms:UR-AK24 | UR-AK57
TypeSmall organic molecule
Emp. Form.C17H29N5O
Mol. Mass.319.4451
SMILESCC(CC(=O)NC(N)=NCCCc1cnc[nH]1)C1CCCCC1