Reaction Details
TargetD(2) dopamine receptor
LigandBDBM86748
Substrate/Competitorn/a
Ki>10000±n/a nM
CommentsPDSP_7576
Citation Deecher, DCBeyer, CEJohnston, GBray, JShah, SAbou-Gharbia, MAndree, TH Desvenlafaxine succinate: A new serotonin and norepinephrine reuptake inhibitor. J Pharmacol Exp Ther318:657-65 (2006) 
 
D(2) dopamine receptor
Name:D(2) dopamine receptor
Type:Cell-surface receptors
Mol. Mass.:50647.10
Organism:Homo sapiens (Human)
Description:P14416
Residue:443
BDBM86748
NameBDBM86748
Synonyms:CAS_386750-22-7 NSC_6918664 US9944618, Compound ID No. 181
TypeSmall organic molecule
Emp. Form.C16H25NO2
Mol. Mass.263.3752
SMILESCN(C)CC(c1ccc(O)cc1)C1(O)CCCCC1