Reaction Details
TargetHistamine H1 receptor
LigandBDBM86748
Substrate/Competitorn/a
Ki>10000±n/a nM
CommentsPDSP_7576
Citation Deecher, DCBeyer, CEJohnston, GBray, JShah, SAbou-Gharbia, MAndree, TH Desvenlafaxine succinate: A new serotonin and norepinephrine reuptake inhibitor. J Pharmacol Exp Ther318:657-65 (2006) 
 
Histamine H1 receptor
Name:Histamine H1 receptor
Type:Enzyme Catalytic Domain
Mol. Mass.:56008.28
Organism:BOVINE
Description:A5D795
Residue:491
BDBM86748
NameBDBM86748
Synonyms:CAS_386750-22-7 NSC_6918664 US9944618, Compound ID No. 181
TypeSmall organic molecule
Emp. Form.C16H25NO2
Mol. Mass.263.3752
SMILESCN(C)CC(c1ccc(O)cc1)C1(O)CCCCC1