Reaction Details
TargetGlutamate receptor 1
LigandBDBM50168962
Substrate/Competitorn/a
Ki>10000±n/a nM
CommentsPDSP_6661
Citation Weiss, BAlt, AOgden, AMGates, MDieckman, DKClemens-Smith, AHo, KHJarvie, KRizkalla, GWright, RACalligaro, DOSchoepp, DMattiuz, ELStratford, REJohnson, BSalhoff, CKatofiasc, MPhebus, LASchenck, KCohen, MFilla, SAOrnstein, PLJohnson, KWBleakman, D Pharmacological characterization of the competitive GLUK5 receptor antagonist decahydroisoquinoline LY466195 in vitro and in vivo. J Pharmacol Exp Ther318:772-81 (2006) 
 
Glutamate receptor 1
Name:Glutamate receptor 1
Type:Enzyme Catalytic Domain
Mol. Mass.:101512.92
Organism:Homo sapiens (Human)
Description:Glutamate AMPA 1 GRIA1 HUMAN::P42261
Residue:906
BDBM50168962
NameBDBM50168962
Synonyms:(3S,4aR,6S,8aR)-6-(4-Carboxy-benzyl)-decahydro-isoquinoline-3-carboxylic acid CHEMBL274226 | LY 382884
TypeSmall organic molecule
Emp. Form.C18H23NO4
Mol. Mass.317.3795
SMILESOC(=O)[C@@H]1C[C@H]2C[C@@H](Cc3ccc(cc3)C(O)=O)CC[C@H]2CN1