Reaction Details
TargetGamma-aminobutyric acid receptor subunit alpha-1
LigandBDBM86757
Substrate/Competitorn/a
Ki>10000±n/a nM
CommentsPDSP_7627
Citation Kumar, JSPrabhakaran, JMajo, VJMilak, MSHsiung, SCTamir, HSimpson, NRVan Heertum, RLMann, JJParsey, RV Synthesis and in vivo evaluation of a novel 5-HT1A receptor agonist radioligand [O-methyl- 11C]2-(4-(4-(2-methoxyphenyl)piperazin-1-yl)butyl)-4-methyl-1,2,4-triazine-3,5(2H,4H)dione in nonhuman primates. Eur J Nucl Med Mol Imaging34:1050-60 (2007) 
 
Gamma-aminobutyric acid receptor subunit alpha-1
Name:Gamma-aminobutyric acid receptor subunit alpha-1
Type:Enzyme Catalytic Domain
Mol. Mass.:51871.33
Organism:BOVINE
Description:P08219
Residue:456
BDBM86757
NameBDBM86757
Synonyms:CAS_0 [11C]MMP
TypeSmall organic molecule
Emp. Form.C19H27N5O3
Mol. Mass.373.4494
SMILESCOc1ccccc1N1CCN(CCCCn2ncc(=O)n(C)c2=O)CC1