Reaction Details
TargetGlutaminase kidney isoform, mitochondrial
LigandBDBM50172138
Substrate/Competitorn/a
Meas. Tech.GLS Enzyme Potency Assay
pH7.8±n/a
IC50 62.8±n/a nM
Commentsextracted
Citation Finlay, MREkwuru, CTCharles, MDRaubo, PAWinter, JJNissink, JW 1,3,4-thiadiazole compounds and their use in treating cancer US Patent US10040788 Publication Date 8/7/2018
 
Glutaminase kidney isoform, mitochondrial
Name:Glutaminase kidney isoform, mitochondrial
Type:Protein
Mol. Mass.:73471.89
Organism:Homo sapiens (Human)
Description:O94925
Residue:669
BDBM50172138
NameBDBM50172138
Synonyms:CHEMBL3808443 US10294221, Example 1(a)
TypeSmall organic molecule
Emp. Form.C18H20N8O2S
Mol. Mass.412.469
SMILESCO[C@H](C(=O)Nc1nnc(N[C@@H]2CCN(C2)c2nccnn2)s1)c1ccccc1