Reaction Details
TargetGlutaminase kidney isoform, mitochondrial
LigandBDBM278403
Substrate/Competitorn/a
Meas. Tech.GLS Enzyme Potency Assay
pH7.8±n/a
IC50 35.5±n/a nM
Commentsextracted
Citation Finlay, MREkwuru, CTCharles, MDRaubo, PAWinter, JJNissink, JW 1,3,4-thiadiazole compounds and their use in treating cancer US Patent US10040788 Publication Date 8/7/2018
 
Glutaminase kidney isoform, mitochondrial
Name:Glutaminase kidney isoform, mitochondrial
Type:Protein
Mol. Mass.:73471.89
Organism:Homo sapiens (Human)
Description:O94925
Residue:669
BDBM278403
NameBDBM278403
Synonyms:(2S)-2-Methoxy-2-(3-methoxyphenyl)-N-[5-[[(3R)-1-(1,2,4-triazin-3-yl)pyrrolidin-3-yl]amino]-1,3,4-thiadiazol-2-yl]acetamide US10294221, Example 4(a)
TypeSmall organic molecule
Emp. Form.C19H22N8O3S
Mol. Mass.442.495
SMILESCO[C@H](C(=O)Nc1nnc(N[C@@H]2CCN(C2)c2nccnn2)s1)c1cccc(OC)c1