Reaction Details
TargetGlutaminase kidney isoform, mitochondrial
LigandBDBM278435
Substrate/Competitorn/a
Meas. Tech.GLS Enzyme Potency Assay
pH7.8±n/a
IC50 43.4±n/a nM
Commentsextracted
Citation Finlay, MREkwuru, CTCharles, MDRaubo, PAWinter, JJNissink, JW 1,3,4-thiadiazole compounds and their use in treating cancer US Patent US10040788 Publication Date 8/7/2018
 
Glutaminase kidney isoform, mitochondrial
Name:Glutaminase kidney isoform, mitochondrial
Type:Protein
Mol. Mass.:73471.89
Organism:Homo sapiens (Human)
Description:O94925
Residue:669
BDBM278435
NameBDBM278435
Synonyms:US10040788, Example 22(b)
TypeSmall organic molecule
Emp. Form.C19H19F3N8O3S
Mol. Mass.496.466
SMILESCO[C@H](C(=O)Nc1nnc(N[C@H]2CCN(C2)c2cncnn2)s1)c1cccc(OC(F)(F)F)c1