Reaction Details
TargetGlutaminase kidney isoform, mitochondrial
LigandBDBM278446
Substrate/Competitorn/a
Meas. Tech.GLS Enzyme Potency Assay
pH7.8±n/a
IC50 84.8±n/a nM
Commentsextracted
Citation Finlay, MREkwuru, CTCharles, MDRaubo, PAWinter, JJNissink, JW 1,3,4-thiadiazole compounds and their use in treating cancer US Patent US10040788 Publication Date 8/7/2018
 
Glutaminase kidney isoform, mitochondrial
Name:Glutaminase kidney isoform, mitochondrial
Type:Protein
Mol. Mass.:73471.89
Organism:Homo sapiens (Human)
Description:O94925
Residue:669
BDBM278446
NameBDBM278446
Synonyms:US10040788, Example 28(b)
TypeSmall organic molecule
Emp. Form.C21H25N7O3S
Mol. Mass.455.533
SMILESCCO[C@H](C(=O)Nc1nnc(N[C@H]2CCN(C2)c2cccnn2)s1)c1ccc(OC)cc1