Reaction Details
TargetGlutaminase kidney isoform, mitochondrial
LigandBDBM278452
Substrate/Competitorn/a
Meas. Tech.GLS Enzyme Potency Assay
pH7.8±n/a
IC50 86.2±n/a nM
Commentsextracted
Citation Finlay, MREkwuru, CTCharles, MDRaubo, PAWinter, JJNissink, JW 1,3,4-thiadiazole compounds and their use in treating cancer US Patent US10040788 Publication Date 8/7/2018
 
Glutaminase kidney isoform, mitochondrial
Name:Glutaminase kidney isoform, mitochondrial
Type:Protein
Mol. Mass.:73471.89
Organism:Homo sapiens (Human)
Description:O94925
Residue:669
BDBM278452
NameBDBM278452
Synonyms:US10040788, Example 31(b)
TypeSmall organic molecule
Emp. Form.C21H24FN7O3S
Mol. Mass.473.524
SMILESCCO[C@H](C(=O)Nc1nnc(N[C@H]2CCN(C2)c2cccnn2)s1)c1ccc(F)c(OC)c1