Reaction Details
TargetNeuronal acetylcholine receptor subunit alpha-4
LigandBDBM86805
Substrate/Competitorn/a
Ki 0.073±n/a nM
CommentsPDSP_8549
Citation Ivy Carroll, FYokota, YMa, WLee, JRBrieaddy, LEBurgess, JPNavarro, HADamaj, MIMartin, BR Synthesis, nicotinic acetylcholine receptor binding, and pharmacological properties of 3'-(substituted phenyl)deschloroepibatidine analogs. Bioorg Med Chem16:746-54 (2008) 
 
Neuronal acetylcholine receptor subunit alpha-4
Name:Neuronal acetylcholine receptor subunit alpha-4
Type:Enzyme
Mol. Mass.:70196.44
Organism:Rattus norvegicus (Rat)
Description:P09483
Residue:630
BDBM86805
NameBDBM86805
Synonyms:CAS_45263788 US9150581, RTI-7527-98 | rac-2-(5-(3-chlorophenyl)-6-fluoropyridin-3-yl)-7-aza-bicyclo[2.2.1]heptane hydrochloride
TypeSmall organic molecule
Emp. Form.C17H16ClFN2
Mol. Mass.302.774
SMILESFc1ncc(cc1-c1cccc(Cl)c1)C1CC2CCC1N2