Reaction Details
TargetNeuronal acetylcholine receptor subunit alpha-4
LigandBDBM86818
Substrate/Competitorn/a
Ki 0.12±n/a nM
CommentsPDSP_8543
Citation Ivy Carroll, FYokota, YMa, WLee, JRBrieaddy, LEBurgess, JPNavarro, HADamaj, MIMartin, BR Synthesis, nicotinic acetylcholine receptor binding, and pharmacological properties of 3'-(substituted phenyl)deschloroepibatidine analogs. Bioorg Med Chem16:746-54 (2008) 
 
Neuronal acetylcholine receptor subunit alpha-4
Name:Neuronal acetylcholine receptor subunit alpha-4
Type:Enzyme
Mol. Mass.:70196.44
Organism:Rattus norvegicus (Rat)
Description:P09483
Residue:630
BDBM86818
NameBDBM86818
Synonyms:CAS_45266054 rac-2-(6-fluoro-5-(3-methoxyphenyl)pyridin-3-yl)-7-aza-bicyclo[2.2.1]heptane hydrochloride
TypeSmall organic molecule
Emp. Form.C18H19FN2O
Mol. Mass.298.3547
SMILESCOc1cccc(c1)-c1cc(cnc1F)C1CC2CCC1N2