Reaction Details
TargetNeuronal acetylcholine receptor subunit alpha-4
LigandBDBM86817
Substrate/Competitorn/a
Ki 0.095±n/a nM
CommentsPDSP_8565
Citation Ivy Carroll, FYokota, YMa, WLee, JRBrieaddy, LEBurgess, JPNavarro, HADamaj, MIMartin, BR Synthesis, nicotinic acetylcholine receptor binding, and pharmacological properties of 3'-(substituted phenyl)deschloroepibatidine analogs. Bioorg Med Chem16:746-54 (2008) 
 
Neuronal acetylcholine receptor subunit alpha-4
Name:Neuronal acetylcholine receptor subunit alpha-4
Type:Enzyme
Mol. Mass.:70196.44
Organism:Rattus norvegicus (Rat)
Description:P09483
Residue:630
BDBM86817
NameBDBM86817
Synonyms:CAS_45263779 rac-4-(5-(7-aza-bicyclo[2.2.1]heptan-2-yl)-2-fluoropyridin-3-yl)benzenamine hydrochloride
TypeSmall organic molecule
Emp. Form.C17H18FN3
Mol. Mass.283.3433
SMILESNc1ccc(cc1)-c1cc(cnc1F)C1CC2CCC1N2