Reaction Details
TargetTyrosine-protein kinase ABL1
LigandBDBM86875
Substrate/Competitorn/a
Ki 70±n/a nM
CommentsPDSP_8421
Citation Radi, MCrespan, EBotta, GFalchi, FMaga, GManetti, FCorradi, VMancini, MSantucci, MASchenone, SBotta, M Discovery and SAR of 1,3,4-thiadiazole derivatives as potent Abl tyrosine kinase inhibitors and cytodifferentiating agents. Bioorg Med Chem Lett18:1207-11 (2008) 
 
Tyrosine-protein kinase ABL1
Name:Tyrosine-protein kinase ABL1
Type:Enzyme
Mol. Mass.:122897.30
Organism:Homo sapiens (Human)
Description:P00519
Residue:1130
BDBM86875
NameBDBM86875
Synonyms:CAS_685639 NSC_685639
TypeSmall organic molecule
Emp. Form.C16H12FN3OS2
Mol. Mass.345.414
SMILESFc1ccc(cc1)C(=O)Nc1nnc(SCc2ccccc2)s1