Reaction Details
TargetProto-oncogene tyrosine-protein kinase Src
LigandBDBM86859
Substrate/Competitorn/a
Ki 217±n/a nM
CommentsPDSP_8422
Citation Radi, MCrespan, EBotta, GFalchi, FMaga, GManetti, FCorradi, VMancini, MSantucci, MASchenone, SBotta, M Discovery and SAR of 1,3,4-thiadiazole derivatives as potent Abl tyrosine kinase inhibitors and cytodifferentiating agents. Bioorg Med Chem Lett18:1207-11 (2008) 
 
Proto-oncogene tyrosine-protein kinase Src
Name:Proto-oncogene tyrosine-protein kinase Src
Type:Protein
Mol. Mass.:59838.60
Organism:Homo sapiens (Human)
Description:P12931
Residue:536
BDBM86859
NameBDBM86859
Synonyms:CAS_1327207 NSC_1327207
TypeSmall organic molecule
Emp. Form.C16H11BrClN3OS2
Mol. Mass.440.765
SMILESClc1ccc(cc1)C(=O)Nc1nnc(SCc2ccc(Br)cc2)s1