Reaction Details
TargetCannabinoid receptor 1
LigandBDBM86887
Substrate/Competitorn/a
Ki 5±n/a nM
CommentsPDSP_8441
Citation Foloppe, NAllen, NHBentley, CHBrooks, TDKennett, GKnight, ARLeonardi, SMisra, AMonck, NJSellwood, DM Discovery of a novel class of selective human CB1 inverse agonists. Bioorg Med Chem Lett18:1199-206 (2008) 
 
Cannabinoid receptor 1
Name:Cannabinoid receptor 1
Type:G Protein-Coupled Receptor (GPCR)
Mol. Mass.:52868.96
Organism:Homo sapiens (Human)
Description:P21554
Residue:472
BDBM86887
NameBDBM86887
Synonyms:5-(3,5-dimethylpiperidin-1-ylsulfonyl)-3-methyl-N-(1,2,3,4-tetrahydronaphthalen-1-yl)benzofuran-2-carboxamide NSC_6621153
TypeSmall organic molecule
Emp. Form.C27H32N2O4S
Mol. Mass.480.619
SMILESCC1CC(C)CN(C1)S(=O)(=O)c1ccc2oc(C(=O)NC3CCCc4ccccc34)c(C)c2c1