Reaction Details
TargetCannabinoid receptor 1
LigandBDBM86889
Substrate/Competitorn/a
Ki 94±n/a nM
CommentsPDSP_8432
Citation Foloppe, NAllen, NHBentley, CHBrooks, TDKennett, GKnight, ARLeonardi, SMisra, AMonck, NJSellwood, DM Discovery of a novel class of selective human CB1 inverse agonists. Bioorg Med Chem Lett18:1199-206 (2008) 
 
Cannabinoid receptor 1
Name:Cannabinoid receptor 1
Type:G Protein-Coupled Receptor (GPCR)
Mol. Mass.:52868.96
Organism:Homo sapiens (Human)
Description:P21554
Residue:472
BDBM86889
NameBDBM86889
Synonyms:CAS_4621779 NSC_4621779
TypeSmall organic molecule
Emp. Form.C21H30N2O4S
Mol. Mass.406.539
SMILESCCCCNC(=O)c1oc2ccc(cc2c1C)S(=O)(=O)N1CC(C)CC(C)C1