Reaction Details
TargetNeuronal acetylcholine receptor subunit alpha-4
LigandBDBM50004108
Substrate/Competitorn/a
Ki 4±n/a nM
CommentsPDSP_1311
Citation Charton, YGuillonneau, CLockhart, BLestage, PGoldstein, S Preparation and affinity profile of novel nicotinic ligands. Bioorg Med Chem Lett18:2188-93 (2008) 
 
Neuronal acetylcholine receptor subunit alpha-4
Name:Neuronal acetylcholine receptor subunit alpha-4
Type:Enzyme
Mol. Mass.:70196.44
Organism:Rattus norvegicus (Rat)
Description:P09483
Residue:630
BDBM50004108
NameBDBM50004108
Synonyms:(+-)-nicotine (RS)-nicotine CHEMBL440464 Nicotine-(+) US11667638, Example Nicotine US9284322, Nicotine nicotine
TypeSmall organic molecule
Emp. Form.C10H14N2
Mol. Mass.162.2316
SMILESCN1CCCC1c1cccnc1