Reaction Details
TargetDelta-type opioid receptor
LigandBDBM86945
Substrate/Competitorn/a
Ki 19.91±n/a nM
CommentsPDSP_8444
Citation Ghirmai, SAzar, MRPolgar, WEBerzetei-Gurske, ICashman, JR Synthesis and biological evaluation of alpha- and beta-6-amido derivatives of 17-cyclopropylmethyl-3, 14beta-dihydroxy-4, 5alpha-epoxymorphinan: potential alcohol-cessation agents. J Med Chem51:1913-24 (2008) 
 
Delta-type opioid receptor
Name:Delta-type opioid receptor
Type:G Protein-Coupled Receptor (GPCR)
Mol. Mass.:40382.98
Organism:Homo sapiens (Human)
Description:Competition binding assays were carried out using membrane preparations from transfected HN9.10 cells that constitutively expressed the delta opioid receptor.
Residue:372
BDBM86945
NameBDBM86945
Synonyms:17-cyclopropylmethyl-3,14-beta-dihydroxy-4,5-alpha-epoxy-6-beta-[(4'-methoxy)benzylacetamido]morphinan ( NSC_24822458
TypeSmall organic molecule
Emp. Form.C29H34N2O5
Mol. Mass.490.5907
SMILESCOc1ccc(CC(=O)NC2CCC3(O)C4Cc5ccc(O)c6OC2C3(CCN4CC2CC2)c56)cc1