Reaction Details
TargetKappa-type opioid receptor
LigandBDBM86927
Substrate/Competitorn/a
Ki 0.51±n/a nM
CommentsPDSP_8467
Citation Ghirmai, SAzar, MRPolgar, WEBerzetei-Gurske, ICashman, JR Synthesis and biological evaluation of alpha- and beta-6-amido derivatives of 17-cyclopropylmethyl-3, 14beta-dihydroxy-4, 5alpha-epoxymorphinan: potential alcohol-cessation agents. J Med Chem51:1913-24 (2008) 
 
Kappa-type opioid receptor
Name:Kappa-type opioid receptor
Type:G Protein-Coupled Receptor (GPCR)
Mol. Mass.:42648.76
Organism:Homo sapiens (Human)
Description:P41145
Residue:380
BDBM86927
NameBDBM86927
Synonyms:17-cyclopropylmethyl-3,14-beta-dihydroxy-4,5-alpha-epoxy-6-alpha-[(2',3',4',6'-tetra-O-benzyl-D-glucopyranosyl)acetamido]morphinan NSC_24822460
TypeSmall organic molecule
Emp. Form.C56H62N2O9
Mol. Mass.907.0995
SMILESOc1ccc2CC3N(CC4CC4)CCC45C(Oc1c24)C(CCC35O)NC(=O)CC1OC(COCc2ccccc2)C(OCc2ccccc2)C(OCc2ccccc2)C1OCc1ccccc1