Reaction Details
TargetKappa-type opioid receptor
LigandBDBM86926
Substrate/Competitorn/a
Ki 2.41±n/a nM
CommentsPDSP_8458
Citation Ghirmai, SAzar, MRPolgar, WEBerzetei-Gurske, ICashman, JR Synthesis and biological evaluation of alpha- and beta-6-amido derivatives of 17-cyclopropylmethyl-3, 14beta-dihydroxy-4, 5alpha-epoxymorphinan: potential alcohol-cessation agents. J Med Chem51:1913-24 (2008) 
 
Kappa-type opioid receptor
Name:Kappa-type opioid receptor
Type:G Protein-Coupled Receptor (GPCR)
Mol. Mass.:42648.76
Organism:Homo sapiens (Human)
Description:P41145
Residue:380
BDBM86926
NameBDBM86926
Synonyms:17-cyclopropylmethyl-3,14-beta-dihydroxy-4,5-alpha-epoxy-6-alpha-[(3', 5'-dimethoxy)benzamido]morphinan CAS_24822296 NSC_24822296 | NSC_24822633
TypeSmall organic molecule
Emp. Form.C29H34N2O6
Mol. Mass.506.5901
SMILESCOc1cc(OC)cc(c1)C(=O)NC1CCC2(O)C3Cc4ccc(O)c5OC1C2(CCN3CC1CC1)c45