Reaction Details
TargetKappa-type opioid receptor
LigandBDBM86935
Substrate/Competitorn/a
Ki 0.43±n/a nM
CommentsPDSP_8445
Citation Ghirmai, SAzar, MRPolgar, WEBerzetei-Gurske, ICashman, JR Synthesis and biological evaluation of alpha- and beta-6-amido derivatives of 17-cyclopropylmethyl-3, 14beta-dihydroxy-4, 5alpha-epoxymorphinan: potential alcohol-cessation agents. J Med Chem51:1913-24 (2008) 
 
Kappa-type opioid receptor
Name:Kappa-type opioid receptor
Type:G Protein-Coupled Receptor (GPCR)
Mol. Mass.:42648.76
Organism:Homo sapiens (Human)
Description:P41145
Residue:380
BDBM86935
NameBDBM86935
Synonyms:17-cyclopropylmethyl-3,14-beta-dihydroxy-4,5-alpha-epoxy-6-beta-(benzylacetamido)morphinan NSC_24822964
TypeSmall organic molecule
Emp. Form.C28H32N2O4
Mol. Mass.460.5647
SMILESOc1ccc2CC3N(CC4CC4)CCC45C(Oc1c24)C(CCC35O)NC(=O)Cc1ccccc1