Reaction Details
TargetKappa-type opioid receptor
LigandBDBM86944
Substrate/Competitorn/a
Ki 0.10±n/a nM
CommentsPDSP_8463
Citation Ghirmai, SAzar, MRPolgar, WEBerzetei-Gurske, ICashman, JR Synthesis and biological evaluation of alpha- and beta-6-amido derivatives of 17-cyclopropylmethyl-3, 14beta-dihydroxy-4, 5alpha-epoxymorphinan: potential alcohol-cessation agents. J Med Chem51:1913-24 (2008) 
 
Kappa-type opioid receptor
Name:Kappa-type opioid receptor
Type:G Protein-Coupled Receptor (GPCR)
Mol. Mass.:42648.76
Organism:Homo sapiens (Human)
Description:P41145
Residue:380
BDBM86944
NameBDBM86944
Synonyms:17-cyclopropylmethyl-3,14-beta-dihydroxy-4,5-alpha-epoxy-6-beta-[(3',4'-dichloro)benzamido]morphinan NSC_24822630
TypeSmall organic molecule
Emp. Form.C27H28Cl2N2O4
Mol. Mass.515.428
SMILESOc1ccc2CC3N(CC4CC4)CCC45C(Oc1c24)C(CCC35O)NC(=O)c1ccc(Cl)c(Cl)c1