Reaction Details
TargetKappa-type opioid receptor
LigandBDBM86955
Substrate/Competitorn/a
Ki 4910±n/a nM
CommentsPDSP_8639
Citation Cunningham, CWMercer, SLHassan, HETraynor, JREddington, NDCoop, A Opioids and efflux transporters. Part 2: P-glycoprotein substrate activity of 3- and 6-substituted morphine analogs. J Med Chem51:2316-20 (2008) 
 
Kappa-type opioid receptor
Name:Kappa-type opioid receptor
Type:G Protein-Coupled Receptor (GPCR)
Mol. Mass.:42648.76
Organism:Homo sapiens (Human)
Description:P41145
Residue:380
BDBM86955
NameBDBM86955
Synonyms:7,8-dihydro-3-desoxymorphine NSC_16039356
TypeSmall organic molecule
Emp. Form.C17H21NO2
Mol. Mass.271.3541
SMILESCN1CCC23C4Oc5cccc(CC1C2CCC4O)c35