Reaction Details
TargetMu-type opioid receptor
LigandBDBM86954
Substrate/Competitorn/a
Ki 305±n/a nM
CommentsPDSP_8634
Citation Cunningham, CWMercer, SLHassan, HETraynor, JREddington, NDCoop, A Opioids and efflux transporters. Part 2: P-glycoprotein substrate activity of 3- and 6-substituted morphine analogs. J Med Chem51:2316-20 (2008) 
 
Mu-type opioid receptor
Name:Mu-type opioid receptor
Type:G Protein-Coupled Receptor (GPCR)
Mol. Mass.:44503.11
Organism:Rattus norvegicus (rat)
Description:Competition binding assays were carried out using membrane preparations from transfected HN9.10 cells that constitutively expressed the mu opioid receptor.
Residue:398
BDBM86954
NameBDBM86954
Synonyms:6-desoxycodeine NSC_5492830
TypeSmall organic molecule
Emp. Form.C18H21NO2
Mol. Mass.283.3648
SMILESCOc1ccc2CC3C4C=CCC5Oc1c2C45CCN3C