Reaction Details
TargetMu-type opioid receptor
LigandBDBM86953
Substrate/Competitorn/a
Ki 524±n/a nM
CommentsPDSP_8636
Citation Cunningham, CWMercer, SLHassan, HETraynor, JREddington, NDCoop, A Opioids and efflux transporters. Part 2: P-glycoprotein substrate activity of 3- and 6-substituted morphine analogs. J Med Chem51:2316-20 (2008) 
 
Mu-type opioid receptor
Name:Mu-type opioid receptor
Type:G Protein-Coupled Receptor (GPCR)
Mol. Mass.:44503.11
Organism:Rattus norvegicus (rat)
Description:Competition binding assays were carried out using membrane preparations from transfected HN9.10 cells that constitutively expressed the mu opioid receptor.
Residue:398
BDBM86953
NameBDBM86953
Synonyms:7,8-dihydro-3-desoxyheterocodeine NSC_24828463
TypeSmall organic molecule
Emp. Form.C18H23NO2
Mol. Mass.285.3807
SMILESCOC1CCC2C3Cc4cccc5OC1C2(CCN3C)c45