Reaction Details
TargetDelta-type opioid receptor
LigandBDBM86974
Substrate/Competitorn/a
Ki 3.2±n/a nM
CommentsPDSP_8572
Citation Le Bourdonnec, BBarker, WMBelanger, SWiant, DDConway-James, NCCassel, JAO'Neill, TJLittle, PJDeHaven, RNDeHaven-Hudkins, DLDolle, RE Novel trans-3,4-dimethyl-4-(3-hydroxyphenyl)piperidines as mu opioid receptor antagonists with improved opioid receptor selectivity profiles. Bioorg Med Chem Lett18:2006-12 (2008) 
 
Delta-type opioid receptor
Name:Delta-type opioid receptor
Type:G Protein-Coupled Receptor (GPCR)
Mol. Mass.:40382.98
Organism:Homo sapiens (Human)
Description:Competition binding assays were carried out using membrane preparations from transfected HN9.10 cells that constitutively expressed the delta opioid receptor.
Residue:372
BDBM86974
NameBDBM86974
Synonyms:(S)-2-((S)-2-(((3R,4R)-4-(3-hydroxyphenyl)-3,4-dimethylpiperidin-1-yl)methyl)-3-phenylpropanamido)-3-(naphthalen-2-yl)propanoic acid NSC_44453728
TypeSmall organic molecule
Emp. Form.C36H40N2O4
Mol. Mass.564.7138
SMILESCC1CN(CC(Cc2ccccc2)C(=O)NC(Cc2ccc3ccccc3c2)C(O)=O)CCC1(C)c1cccc(O)c1