Reaction Details
TargetDelta-type opioid receptor
LigandBDBM86972
Substrate/Competitorn/a
Ki 24±n/a nM
CommentsPDSP_8578
Citation Le Bourdonnec, BBarker, WMBelanger, SWiant, DDConway-James, NCCassel, JAO'Neill, TJLittle, PJDeHaven, RNDeHaven-Hudkins, DLDolle, RE Novel trans-3,4-dimethyl-4-(3-hydroxyphenyl)piperidines as mu opioid receptor antagonists with improved opioid receptor selectivity profiles. Bioorg Med Chem Lett18:2006-12 (2008) 
 
Delta-type opioid receptor
Name:Delta-type opioid receptor
Type:G Protein-Coupled Receptor (GPCR)
Mol. Mass.:40382.98
Organism:Homo sapiens (Human)
Description:Competition binding assays were carried out using membrane preparations from transfected HN9.10 cells that constitutively expressed the delta opioid receptor.
Residue:372
BDBM86972
NameBDBM86972
Synonyms:(S)-2-(N-(3-chlorobenzyl)-3-((3R,4R)-4-(3-hydroxyphenyl)-3,4-dimethylpiperidin-1-yl)propanamido)-3-phenylpropanoic acid NSC_44453824
TypeSmall organic molecule
Emp. Form.C32H37ClN2O4
Mol. Mass.549.1
SMILESCC1CN(CCC(=O)N(Cc2cccc(Cl)c2)C(Cc2ccccc2)C(O)=O)CCC1(C)c1cccc(O)c1