Reaction Details
TargetKappa-type opioid receptor
LigandBDBM86960
Substrate/Competitorn/a
Ki 230±n/a nM
CommentsPDSP_8579
Citation Le Bourdonnec, BBarker, WMBelanger, SWiant, DDConway-James, NCCassel, JAO'Neill, TJLittle, PJDeHaven, RNDeHaven-Hudkins, DLDolle, RE Novel trans-3,4-dimethyl-4-(3-hydroxyphenyl)piperidines as mu opioid receptor antagonists with improved opioid receptor selectivity profiles. Bioorg Med Chem Lett18:2006-12 (2008) 
 
Kappa-type opioid receptor
Name:Kappa-type opioid receptor
Type:G Protein-Coupled Receptor (GPCR)
Mol. Mass.:42648.76
Organism:Homo sapiens (Human)
Description:P41145
Residue:380
BDBM86960
NameBDBM86960
Synonyms:(S)-2-(biphenyl-4-ylmethyl-{3-[(3R,4R)-4-(3-hydroxy-phenyl)-3,4-dimethyl-piperidin-1-yl]-propionyl}-amino)-3-phenyl-propionic acid NSC_44453825
TypeSmall organic molecule
Emp. Form.C38H42N2O4
Mol. Mass.590.7511
SMILESCC1CN(CCC(=O)N(Cc2ccc(cc2)-c2ccccc2)C(Cc2ccccc2)C(O)=O)CCC1(C)c1cccc(O)c1