Reaction Details
TargetMu-type opioid receptor
LigandBDBM86971
Substrate/Competitorn/a
Ki 28±n/a nM
CommentsPDSP_8584
Citation Le Bourdonnec, BBarker, WMBelanger, SWiant, DDConway-James, NCCassel, JAO'Neill, TJLittle, PJDeHaven, RNDeHaven-Hudkins, DLDolle, RE Novel trans-3,4-dimethyl-4-(3-hydroxyphenyl)piperidines as mu opioid receptor antagonists with improved opioid receptor selectivity profiles. Bioorg Med Chem Lett18:2006-12 (2008) 
 
Mu-type opioid receptor
Name:Mu-type opioid receptor
Type:G Protein-Coupled Receptor (GPCR)
Mol. Mass.:44789.51
Organism:Homo sapiens (Human)
Description:P35372
Residue:400
BDBM86971
NameBDBM86971
Synonyms:(S)-2-(3-((3R,4R)-4-(3-hydroxyphenyl)-3,4-dimethylpiperidin-1-yl)-N-isobutylpropanamido)-3-phenylpropanoic acid NSC_44453880
TypeSmall organic molecule
Emp. Form.C29H40N2O4
Mol. Mass.480.6389
SMILESCC(C)CN(C(Cc1ccccc1)C(O)=O)C(=O)CCN1CCC(C)(C(C)C1)c1cccc(O)c1