Reaction Details
TargetMu-type opioid receptor
LigandBDBM86961
Substrate/Competitorn/a
Ki 1.9±n/a nM
CommentsPDSP_8574
Citation Le Bourdonnec, BBarker, WMBelanger, SWiant, DDConway-James, NCCassel, JAO'Neill, TJLittle, PJDeHaven, RNDeHaven-Hudkins, DLDolle, RE Novel trans-3,4-dimethyl-4-(3-hydroxyphenyl)piperidines as mu opioid receptor antagonists with improved opioid receptor selectivity profiles. Bioorg Med Chem Lett18:2006-12 (2008) 
 
Mu-type opioid receptor
Name:Mu-type opioid receptor
Type:G Protein-Coupled Receptor (GPCR)
Mol. Mass.:44789.51
Organism:Homo sapiens (Human)
Description:P35372
Residue:400
BDBM86961
NameBDBM86961
Synonyms:(S)-2-{(S)-2-benzyl-3-[(3R,4R)-4-(3-hydroxy-phenyl)-3,4-dimethyl-piperidin-1-yl]-propionylamino}-3-biphenyl-4-yl-propionic acid NSC_44453779
TypeSmall organic molecule
Emp. Form.C38H42N2O4
Mol. Mass.590.7511
SMILESCC1CN(CC(Cc2ccccc2)C(=O)NC(Cc2ccc(cc2)-c2ccccc2)C(O)=O)CCC1(C)c1cccc(O)c1