Reaction Details
TargetMu-type opioid receptor
LigandBDBM86967
Substrate/Competitorn/a
Ki 80±n/a nM
CommentsPDSP_8588
Citation Le Bourdonnec, BBarker, WMBelanger, SWiant, DDConway-James, NCCassel, JAO'Neill, TJLittle, PJDeHaven, RNDeHaven-Hudkins, DLDolle, RE Novel trans-3,4-dimethyl-4-(3-hydroxyphenyl)piperidines as mu opioid receptor antagonists with improved opioid receptor selectivity profiles. Bioorg Med Chem Lett18:2006-12 (2008) 
 
Mu-type opioid receptor
Name:Mu-type opioid receptor
Type:G Protein-Coupled Receptor (GPCR)
Mol. Mass.:44789.51
Organism:Homo sapiens (Human)
Description:P35372
Residue:400
BDBM86967
NameBDBM86967
Synonyms:(S)-3-biphenyl-4-yl-2-{3-[(3R,4R)-4-(3-hydroxy-phenyl)-3,4-dimethyl-piperidin-1-yl]-propionylamino}-propionic acid NSC_44453925
TypeSmall organic molecule
Emp. Form.C31H36N2O4
Mol. Mass.500.6285
SMILESCC1CN(CCC(=O)NC(Cc2ccc(cc2)-c2ccccc2)C(O)=O)CCC1(C)c1cccc(O)c1