Reaction Details
TargetCannabinoid receptor 1
LigandBDBM86992
Substrate/Competitorn/a
Ki 7±n/a nM
CommentsPDSP_8483
Citation Alig, LAlsenz, JAndjelkovic, MBendels, SBénardeau, ABleicher, KBourson, ADavid-Pierson, PGuba, WHildbrand, SKube, DLübbers, TMayweg, AVNarquizian, RNeidhart, WNettekoven, MPlancher, JMRocha, CRogers-Evans, MRöver, SSchneider, GTaylor, SWaldmeier, P Benzodioxoles: novel cannabinoid-1 receptor inverse agonists for the treatment of obesity. J Med Chem51:2115-27 (2008) 
 
Cannabinoid receptor 1
Name:Cannabinoid receptor 1
Type:G Protein-Coupled Receptor (GPCR)
Mol. Mass.:52868.96
Organism:Homo sapiens (Human)
Description:P21554
Residue:472
BDBM86992
NameBDBM86992
Synonyms:(2,2-bis(2,4-difluorophenyl)-6-fluorobenzo[d][1,3]dioxol-5-yl)(morpholino)methanone NSC_22475130
TypeSmall organic molecule
Emp. Form.C24H16F5NO4
Mol. Mass.477.3802
SMILESFc1ccc(c(F)c1)C1(Oc2cc(F)c(cc2O1)C(=O)N1CCOCC1)c1ccc(F)cc1F