Reaction Details
TargetCannabinoid receptor 1
LigandBDBM86999
Substrate/Competitorn/a
Ki 13±n/a nM
CommentsPDSP_8491
Citation Alig, LAlsenz, JAndjelkovic, MBendels, SBénardeau, ABleicher, KBourson, ADavid-Pierson, PGuba, WHildbrand, SKube, DLübbers, TMayweg, AVNarquizian, RNeidhart, WNettekoven, MPlancher, JMRocha, CRogers-Evans, MRöver, SSchneider, GTaylor, SWaldmeier, P Benzodioxoles: novel cannabinoid-1 receptor inverse agonists for the treatment of obesity. J Med Chem51:2115-27 (2008) 
 
Cannabinoid receptor 1
Name:Cannabinoid receptor 1
Type:G Protein-Coupled Receptor (GPCR)
Mol. Mass.:52868.96
Organism:Homo sapiens (Human)
Description:P21554
Residue:472
BDBM86999
NameBDBM86999
Synonyms:(2,2-diphenyl-[1,3]dioxolo[4,5-c]pyridin-6-yl)-piperidin-1-ylmethanone NSC_24828561
TypeSmall organic molecule
Emp. Form.C24H22N2O3
Mol. Mass.386.4431
SMILESO=C(N1CCCCC1)c1cc2OC(Oc2cn1)(c1ccccc1)c1ccccc1