Reaction Details
TargetCannabinoid receptor 1
LigandBDBM86984
Substrate/Competitorn/a
Ki 3.3±n/a nM
CommentsPDSP_8469
Citation Alig, LAlsenz, JAndjelkovic, MBendels, SBénardeau, ABleicher, KBourson, ADavid-Pierson, PGuba, WHildbrand, SKube, DLübbers, TMayweg, AVNarquizian, RNeidhart, WNettekoven, MPlancher, JMRocha, CRogers-Evans, MRöver, SSchneider, GTaylor, SWaldmeier, P Benzodioxoles: novel cannabinoid-1 receptor inverse agonists for the treatment of obesity. J Med Chem51:2115-27 (2008) 
 
Cannabinoid receptor 1
Name:Cannabinoid receptor 1
Type:G Protein-Coupled Receptor (GPCR)
Mol. Mass.:52868.96
Organism:Homo sapiens (Human)
Description:P21554
Residue:472
BDBM86984
NameBDBM86984
Synonyms:(R)-[2-(2,4-dichloro-phenyl)-6-fluoro-2-(4-fluoro-phenyl)-benzo[1,3]dioxol-5-yl]-morpholin-4-yl-methanone CAS_22475020 CAS_24828563 NSC_24828562 [2-(2,4-dichloro-phenyl)-6-fluoro-2-(4-fluoro-phenyl)-benzo[1,3]dioxol-5-yl]-morpholin-4-yl-methanone
TypeSmall organic molecule
Emp. Form.C24H17Cl2F2NO4
Mol. Mass.492.299
SMILESFc1ccc(cc1)C1(Oc2cc(F)c(cc2O1)C(=O)N1CCOCC1)c1ccc(Cl)cc1Cl