Reaction Details
TargetCannabinoid receptor 1
LigandBDBM87004
Substrate/Competitorn/a
Ki 38±n/a nM
CommentsPDSP_8495
Citation Alig, LAlsenz, JAndjelkovic, MBendels, SBénardeau, ABleicher, KBourson, ADavid-Pierson, PGuba, WHildbrand, SKube, DLübbers, TMayweg, AVNarquizian, RNeidhart, WNettekoven, MPlancher, JMRocha, CRogers-Evans, MRöver, SSchneider, GTaylor, SWaldmeier, P Benzodioxoles: novel cannabinoid-1 receptor inverse agonists for the treatment of obesity. J Med Chem51:2115-27 (2008) 
 
Cannabinoid receptor 1
Name:Cannabinoid receptor 1
Type:G Protein-Coupled Receptor (GPCR)
Mol. Mass.:52868.96
Organism:Homo sapiens (Human)
Description:P21554
Residue:472
BDBM87004
NameBDBM87004
Synonyms:1-(2,2-diphenyl-benzo[1,3]dioxole-5-sulfonyl)-piperidine NSC_10342137
TypeSmall organic molecule
Emp. Form.C24H23NO4S
Mol. Mass.421.509
SMILESO=S(=O)(N1CCCCC1)c1ccc2OC(Oc2c1)(c1ccccc1)c1ccccc1