Reaction Details
TargetCannabinoid receptor 1
LigandBDBM87009
Substrate/Competitorn/a
Ki 9±n/a nM
CommentsPDSP_8478
Citation Alig, LAlsenz, JAndjelkovic, MBendels, SBénardeau, ABleicher, KBourson, ADavid-Pierson, PGuba, WHildbrand, SKube, DLübbers, TMayweg, AVNarquizian, RNeidhart, WNettekoven, MPlancher, JMRocha, CRogers-Evans, MRöver, SSchneider, GTaylor, SWaldmeier, P Benzodioxoles: novel cannabinoid-1 receptor inverse agonists for the treatment of obesity. J Med Chem51:2115-27 (2008) 
 
Cannabinoid receptor 1
Name:Cannabinoid receptor 1
Type:G Protein-Coupled Receptor (GPCR)
Mol. Mass.:52868.96
Organism:Homo sapiens (Human)
Description:P21554
Residue:472
BDBM87009
NameBDBM87009
Synonyms:4-(2-(2,4-dichlorophenyl)-6-fluoro-2-(4-fluorophenyl)benzo[d][1,3]dioxol-5-ylsulfonyl)morpholine NSC_22475238
TypeSmall organic molecule
Emp. Form.C23H17Cl2F2NO5S
Mol. Mass.528.353
SMILESFc1ccc(cc1)C1(Oc2cc(F)c(cc2O1)S(=O)(=O)N1CCOCC1)c1ccc(Cl)cc1Cl