Reaction Details
TargetAurora kinase A
LigandBDBM87049
Substrate/Competitorn/a
Meas. Tech.Enzyme Activity Assay
pH7.4±0
Temperature298.15±0 K
IC50 149±23 nM
Kd 299±27 nM
Citation Martin, MPZhu, JYLawrence, HRPireddu, RLuo, YAlam, ROzcan, SSebti, SMLawrence, NJSchönbrunn, E A novel mechanism by which small molecule inhibitors induce the DFG flip in Aurora A. ACS Chem Biol7:698-706 (2012) 
 
Aurora kinase A
Name:Aurora kinase A
Type:Serine/threonine-protein kinase
Mol. Mass.:45830.98
Organism:Homo sapiens (Human)
Description:O14965
Residue:403
BDBM87049
NameBDBM87049
Synonyms:Bisanilinopyrimidine inhibitor, 3
TypeSmall organic molecule
Emp. Form.C24H20N4O2
Mol. Mass.396.4412
SMILESOC(=O)c1ccc(Nc2nccc(Nc3ccccc3Cc3ccccc3)n2)cc1