Reaction Details
TargetAurora kinase A
LigandBDBM87054
Substrate/Competitorn/a
Meas. Tech.Enzyme Activity Assay
pH7.4±0
Temperature298.15±0 K
IC50 2.1±0.4 nM
Kd 13±2.2 nM
Citation Martin, MPZhu, JYLawrence, HRPireddu, RLuo, YAlam, ROzcan, SSebti, SMLawrence, NJSchönbrunn, E A novel mechanism by which small molecule inhibitors induce the DFG flip in Aurora A. ACS Chem Biol7:698-706 (2012) 
 
Aurora kinase A
Name:Aurora kinase A
Type:Serine/threonine-protein kinase
Mol. Mass.:45830.98
Organism:Homo sapiens (Human)
Description:O14965
Residue:403
BDBM87054
NameBDBM87054
Synonyms:Bisanilinopyrimidine inhibitor, 8 US9249124, 32
TypeSmall organic molecule
Emp. Form.C17H13BrN4O2
Mol. Mass.385.215
SMILESOC(=O)c1ccc(Nc2nccc(Nc3ccccc3Br)n2)cc1