Reaction Details
TargetPhospholipase D1
LigandBDBM87183
Substrate/Competitorn/a
Meas. Tech.Cellular PLD1 concentration response
IC50 2±n/a nM
Citation PubChem, PC Cellular PLD1 concentration response PubChem Bioassay(2011)[AID]
 
Phospholipase D1
Name:Phospholipase D1
Type:Protein
Mol. Mass.:124219.92
Organism:Homo sapiens (Human)
Description:Q13393
Residue:1074
BDBM87183
NameBDBM87183
Synonyms:N-[(1R)-2-[4-(5-chloro-2-keto-3H-benzimidazol-1-yl)piperidino]-1-methyl-ethyl]-1H-indole-2-carboxamide;2,2,2-trifluoroacetic acid N-[(2R)-1-[4-(5-chloro-2-oxo-3H-benzimidazol-1-yl)-1-piperidinyl]propan-2-yl]-1H-indole-2-carboxamide;2,2,2-trifluoroacetic acid VU0364737-1 | cid_53470048
TypeSmall organic molecule
Emp. Form.C24H26ClN5O2
Mol. Mass.451.949
SMILESC[C@H](CN1CCC(CC1)n1c2ccc(Cl)cc2[nH]c1=O)NC(=O)c1cc2ccccc2[nH]1