Reaction Details
TargetNuclear receptor coactivator 3
LigandBDBM77529
Substrate/Competitorn/a
Meas. Tech.Luminescence-based cell-based high throughput dose response assay for inhibitors of the Steroid Receptor Coactivator 3 (SRC3; NCOA3)
IC50 7710±n/a nM
Citation PubChem, PC Luminescence-based cell-based high throughput dose response assay for inhibitors of the Steroid Receptor Coactivator 3 (SRC3; NCOA3) PubChem Bioassay(2012)[AID]
 
Nuclear receptor coactivator 3
Name:Nuclear receptor coactivator 3
Type:Enzyme Catalytic Domain
Mol. Mass.:155305.29
Organism:Homo sapiens (Human)
Description:Q9Y6Q9
Residue:1424
BDBM77529
NameBDBM77529
Synonyms:MLS000548411 N-[1,3-benzodioxol-5-yl-(5-chloro-8-hydroxy-7-quinolinyl)methyl]butanamide N-[1,3-benzodioxol-5-yl-(5-chloro-8-hydroxyquinolin-7-yl)methyl]butanamide SMR000172091 | cid_3138755
TypeSmall organic molecule
Emp. Form.C21H19ClN2O4
Mol. Mass.398.84
SMILESCCCC(=O)NC(c1ccc2OCOc2c1)c1cc(Cl)c2cccnc2c1O