Reaction Details
TargetNuclear receptor coactivator 3
LigandBDBM87345
Substrate/Competitorn/a
Meas. Tech.Luminescence-based cell-based high throughput dose response assay for inhibitors of the Steroid Receptor Coactivator 3 (SRC3; NCOA3)
IC50 1763±n/a nM
Citation PubChem, PC Luminescence-based cell-based high throughput dose response assay for inhibitors of the Steroid Receptor Coactivator 3 (SRC3; NCOA3) PubChem Bioassay(2012)[AID]
 
Nuclear receptor coactivator 3
Name:Nuclear receptor coactivator 3
Type:Enzyme Catalytic Domain
Mol. Mass.:155305.29
Organism:Homo sapiens (Human)
Description:Q9Y6Q9
Residue:1424
BDBM87345
NameBDBM87345
Synonyms:MLS001034533 N-cyclopentyl-4-[(5Z)-5-[(4-methylphenyl)methylidene]-4-oxidanylidene-2-sulfanylidene-1,3-thiazolidin-3-yl]butanamide N-cyclopentyl-4-[(5Z)-5-[(4-methylphenyl)methylidene]-4-oxo-2-sulfanylidene-3-thiazolidinyl]butanamide cid_1344474
TypeSmall organic molecule
Emp. Form.C20H24N2O2S2
Mol. Mass.388.547
SMILESCc1ccc(\C=C2/SC(=S)N(CCCC(=O)NC3CCCC3)C2=O)cc1